Publikující,Publikující ID OVM (IČO),Datová schránka publikujícího,Kraj publikujícího,Číslo právního předpisu,Druh právního předpisu,Název právního předpisu,Datum vydání,Datum zveřejnění ve Sbírce,Datum nabytí účinnosti,Způsob zveřejnění,Datum vyvěšení na úřední desce,Oblast právní úpravy,Zákonné zmocnění,Novelizuje,Zrušuje,Je novelizován,Je rušen,Platný právní předpis,Zrušeno k,URL záznamu,ID zprávy prvotního vkladu,Verze
Obec Příšovice,00263125,hm8bbw3,Liberecký kraj,1/2024,Nařízení,o zákazu podomního a pochůzkového prodeje na území obce Příšovice,2024-01-17 12:41:51.213941+01:00,2024-01-17 12:41:51.213941+01:00,2024-02-01,Běžný,,regulace podomního a pochůzkového prodeje a nabízení služeb,"zákon č. 455/1991 Sb., živnostenský zákon - § 18 odst. 4 ",,,,,True,,https://sbirkapp.gov.cz/detail/SPPDWTBUCTNLYCHO,1301204400,1
Obec Příšovice,00263125,hm8bbw3,Liberecký kraj,6/2023,Obecně závazná vyhláška,o místním poplatku za obecní systém odpadového hospodářství,2023-12-13 15:10:31.022642+01:00,2023-12-13 15:10:31.022642+01:00,2024-01-01,Běžný,,místní poplatek za obecní systém odpadového hospodářství,"zákon č. 565/1990 Sb., o místních poplatcích - § 14 - za obecní systém odpadového hospodářství",,2/2021: Obecně závazná vyhláška obce Příšovice č. 2/2021 o místním poplatku za obecní systém odpadového hospodářství,,,True,,https://sbirkapp.gov.cz/detail/SPPASEXLUBR5WY6Y,1285296954,1
Obec Příšovice,00263125,hm8bbw3,Liberecký kraj,5/2023,Obecně závazná vyhláška,o místním poplatku ze vstupného,2023-12-13 15:08:41.282797+01:00,2023-12-13 15:08:41.282797+01:00,2024-01-01,Běžný,,místní poplatek ze vstupného,"zákon č. 565/1990 Sb., o místních poplatcích - § 14 - ze vstupného",,3/2019: o místním poplatku ze vstupného,,,True,,https://sbirkapp.gov.cz/detail/SPPGRZQHLOIWWEF2,1285295682,1
Obec Příšovice,00263125,hm8bbw3,Liberecký kraj,4/2023,Obecně závazná vyhláška,o místním poplatku za povolení k vjezdu s motorovým vozidlem do vybraných míst a částí měst,2023-12-13 15:06:51.340031+01:00,2023-12-13 15:06:51.340031+01:00,2024-01-01,Běžný,,místní poplatek za povolení k vjezdu,"zákon č. 565/1990 Sb., o místních poplatcích - § 14 - za povolení k vjezdu",,2/2022: o místním poplatku za povolení k vjezdu s motorovým vozidlem do vybraných míst a částí měst,,,True,,https://sbirkapp.gov.cz/detail/SPPVVQORZIAGV5SO,1285294535,1
Obec Příšovice,00263125,hm8bbw3,Liberecký kraj,3/2023,Obecně závazná vyhláška,o místním poplatku ze psů,2023-12-13 15:05:06.889064+01:00,2023-12-13 15:05:06.889064+01:00,2024-01-01,Běžný,,místní poplatek ze psů,"zákon č. 565/1990 Sb., o místních poplatcích - § 14 - ze psů",,1/2022: o místním poplatku ze psů,,,True,,https://sbirkapp.gov.cz/detail/SPPGKVZQKZF6CNGY,1285293027,1
Obec Příšovice,00263125,hm8bbw3,Liberecký kraj,2/2023,Obecně závazná vyhláška,o stanovení obecního systému odpadového hospodářství,2023-05-09 13:35:35.557633+02:00,2023-05-09 13:35:35.557633+02:00,2023-05-24,Běžný,,systém odpadového hospodářství,"zákon č. 541/2020 Sb., o odpadech - § 59 odst. 4",,,,,True,,https://sbirkapp.gov.cz/detail/SPPSJ2KAY7A6XKP2,1187079365,1
Obec Příšovice,00263125,hm8bbw3,Liberecký kraj,1/2023,Obecně závazná vyhláška,požární řád,2023-02-20 13:59:49.724935+01:00,2023-02-20 13:59:49.724935+01:00,2023-03-07,Běžný,,požární ochrana - požární řád,"zákon č. 133/1985 Sb., o požární ochraně - § 29 odst. 1 písm. o) bod 1",,3/2022: požární řád,,,True,,https://sbirkapp.gov.cz/detail/SPP4H33ODCOB73WM,1146375445,2
Obec Příšovice,00263125,hm8bbw3,Liberecký kraj,3/2022,Obecně závazná vyhláška,požární řád,2022-12-16 08:14:46.567890+01:00,2022-12-16 08:14:46.567890+01:00,2022-12-31,Běžný,,požární ochrana - požární řád,"zákon č. 133/1985 Sb., o požární ochraně - § 29 odst. 1 písm. o) bod 1",,,,1/2023: požární řád,False,2023-03-07,https://sbirkapp.gov.cz/detail/SPP2ZANMLB534IC6,1117070004,2
Obec Příšovice,00263125,hm8bbw3,Liberecký kraj,2/2022,Obecně závazná vyhláška,o místním poplatku za povolení k vjezdu s motorovým vozidlem do vybraných míst a částí měst,2022-12-16 08:09:28.739397+01:00,2022-12-16 08:09:28.739397+01:00,2023-01-01,Běžný,,místní poplatek za povolení k vjezdu,"zákon č. 565/1990 Sb., o místních poplatcích - § 14 - za povolení k vjezdu",,,,4/2023: o místním poplatku za povolení k vjezdu s motorovým vozidlem do vybraných míst a částí měst,False,2024-01-01,https://sbirkapp.gov.cz/detail/SPPHUZW6SPLFPCSS,1117067823,1
Obec Příšovice,00263125,hm8bbw3,Liberecký kraj,1/2022,Obecně závazná vyhláška,o místním poplatku ze psů,2022-12-16 08:01:30.789127+01:00,2022-12-16 08:01:30.789127+01:00,2023-01-01,Běžný,,místní poplatek ze psů,"zákon č. 565/1990 Sb., o místních poplatcích - § 14 - ze psů",,,,3/2023: o místním poplatku ze psů,False,2024-01-01,https://sbirkapp.gov.cz/detail/SPPBIKKATPXC3ZNW,1117064128,1
Obec Příšovice,00263125,hm8bbw3,Liberecký kraj,2/2011,Obecně závazná vyhláška,o zákazu provozování výherních hracích přístrojů  a interaktivních videoloterijních terminálů na území obce Příšovice,2011-12-15,2022-10-17 13:36:27.600451+02:00,2012-01-01,Dle přechodného ustanovení,2011-12-15,hazardní hry,"zákon č. 186/2016 Sb., o hazardních hrách - § 12 ",,,,,True,,https://sbirkapp.gov.cz/detail/SPPX6QHZELHOHIPA,1094481125,1
Obec Příšovice,00263125,hm8bbw3,Liberecký kraj,3/2019,Obecně závazná vyhláška,o místním poplatku ze vstupného,2019-12-13,2022-10-17 13:23:39.244043+02:00,2020-01-01,Dle přechodného ustanovení,2019-12-13,místní poplatek ze vstupného,"zákon č. 565/1990 Sb., o místních poplatcích - § 14 - ze vstupného",,,,5/2023: o místním poplatku ze vstupného,False,2024-01-01,https://sbirkapp.gov.cz/detail/SPPTGBAFZR3CR2RK,1094473662,2
Obec Příšovice,00263125,hm8bbw3,Liberecký kraj,1/2017,Obecně závazná vyhláška,kterou se stanoví část společného školského obvodu mateřské školy,2017-12-14,2022-10-17 08:59:28.869437+02:00,2017-12-29,Dle přechodného ustanovení,2017-12-14,školské obvody - mateřské školy,"zákon č. 561/2004 Sb., školský zákon - § 179 odst. 3 a § 178 odst. 2 písm. c)",,,,,True,,https://sbirkapp.gov.cz/detail/SPPEPRIA3AACONPK,1094297391,1
Obec Příšovice,00263125,hm8bbw3,Liberecký kraj,2/2021,Obecně závazná vyhláška,Obecně závazná vyhláška obce Příšovice č. 2/2021 o místním poplatku za obecní systém odpadového hospodářství,2021-12-16,2022-10-10 16:30:06.771009+02:00,2022-01-01,Dle přechodného ustanovení,2021-12-16,místní poplatek za obecní systém odpadového hospodářství,"zákon č. 565/1990 Sb., o místních poplatcích - § 14 - za obecní systém odpadového hospodářství",,,,6/2023: o místním poplatku za obecní systém odpadového hospodářství,False,2024-01-01,https://sbirkapp.gov.cz/detail/SPPNLVIUOXLL5JR6,1091979053,1
