Publikující,Publikující ID OVM (IČO),Datová schránka publikujícího,Kraj publikujícího,Číslo právního předpisu,Druh právního předpisu,Název právního předpisu,Datum vydání,Datum zveřejnění ve Sbírce,Datum nabytí účinnosti,Způsob zveřejnění,Datum vyvěšení na úřední desce,Oblast právní úpravy,Zákonné zmocnění,Novelizuje,Zrušuje,Je novelizován,Je rušen,Platný právní předpis,Zrušeno k,URL záznamu,ID zprávy prvotního vkladu,Verze
Město Klecany,00240290,4d6bdnh,Středočeský kraj,2/2023,Obecně závazná vyhláška,o stanovení koeficientů pro výpočet daně z nemovitých věcí,2023-11-24 09:58:43.493015+01:00,2023-11-24 09:58:43.493015+01:00,2024-01-01,Běžný,,daň z nemovitých věcí - koeficient u pozemků; daň z nemovitých věcí - koeficient u staveb a jednotek; daň z nemovitých věcí - koeficient u staveb a jednotek; daň z nemovitých věcí - místní koeficient,"zákon č. 338/1992 Sb., o dani z nemovitých věcí - § 6 odst. 4 písm. b); zákon č. 338/1992 Sb., o dani z nemovitých věcí - § 11 odst. 3 písm. a)  ; zákon č. 338/1992 Sb., o dani z nemovitých věcí - § 11 odst. 3 písm. b)  ; zákon č. 338/1992 Sb., o dani z nemovitých věcí - § 12",1/2023: Obecně závazná vyhláška o stanovení koeficientů pro výpočet daně z nemovitých věcí,,,,True,,https://sbirkapp.gov.cz/detail/SPPI2YOYLACTGOAO,1276468700,1
Město Klecany,00240290,4d6bdnh,Středočeský kraj,1/2023,Obecně závazná vyhláška,Obecně závazná vyhláška o stanovení koeficientů pro výpočet daně z nemovitých věcí,2023-09-25 16:18:52.718293+02:00,2023-09-25 16:18:52.718293+02:00,2024-01-01,Běžný,,daň z nemovitých věcí - koeficient u pozemků; daň z nemovitých věcí - koeficient u staveb a jednotek; daň z nemovitých věcí - koeficient u staveb a jednotek; daň z nemovitých věcí - místní koeficient,"zákon č. 338/1992 Sb., o dani z nemovitých věcí - § 6 odst. 4 písm. b); zákon č. 338/1992 Sb., o dani z nemovitých věcí - § 11 odst. 3 písm. a)  ; zákon č. 338/1992 Sb., o dani z nemovitých věcí - § 11 odst. 3 písm. b)  ; zákon č. 338/1992 Sb., o dani z nemovitých věcí - § 12",,,2/2023: o stanovení koeficientů pro výpočet daně z nemovitých věcí,,True,,https://sbirkapp.gov.cz/detail/SPP6FVWS4RCRQ7A2,1246190140,1
Město Klecany,00240290,4d6bdnh,Středočeský kraj,5/2022,Obecně závazná vyhláška,O koeficientu pro stanovení daně z nemovitosti,2022-12-13 11:07:35.644260+01:00,2022-12-13 11:07:35.644260+01:00,2022-12-28,Běžný,,zrušovací,"ústavní zákon č. 1/1993 Sb., Ústava České republiky - čl. 104 odst. 3 - zrušovací OZV",,3/2022: O koeficientu pro stanovení daně z nemovitosti ,,,True,,https://sbirkapp.gov.cz/detail/SPPZCT3MNVLGSNBM,1115410220,2
Město Klecany,00240290,4d6bdnh,Středočeský kraj,4/2022,Obecně závazná vyhláška,O místním poplatku za obecní systém odpadovém hospodářství,2022-09-23 10:47:26.937005+02:00,2022-09-23 10:47:26.937005+02:00,2022-10-08,Běžný,,místní poplatek za obecní systém odpadového hospodářství,"zákon č. 565/1990 Sb., o místních poplatcích - § 14 - za obecní systém odpadového hospodářství",2/2021: O místním poplatku za obecní systém odpadovém hospodářství,,,,True,,https://sbirkapp.gov.cz/detail/SPPRHKTDTRMTZ6QS,1086137466,1
Město Klecany,00240290,4d6bdnh,Středočeský kraj,2/2021,Obecně závazná vyhláška,O místním poplatku za obecní systém odpadovém hospodářství,2021-12-16,2022-09-23 10:07:11.807992+02:00,2022-01-01,Dle přechodného ustanovení,2021-12-16,místní poplatek za obecní systém odpadového hospodářství,"zákon č. 565/1990 Sb., o místních poplatcích - § 14 - za obecní systém odpadového hospodářství",,,4/2022: O místním poplatku za obecní systém odpadovém hospodářství,2/2022: O místním poplatku za obecní systém odpadovém hospodářství,False,2023-01-01,https://sbirkapp.gov.cz/detail/SPPZXI2ZHXF3EXXQ,1086106198,1
Město Klecany,00240290,4d6bdnh,Středočeský kraj,3/2022,Obecně závazná vyhláška,O koeficientu pro stanovení daně z nemovitosti ,2022-09-23 09:42:42.686093+02:00,2022-09-23 09:42:42.686093+02:00,2023-01-01,Běžný,,daň z nemovitých věcí - místní koeficient,"zákon č. 338/1992 Sb., o dani z nemovitých věcí - § 12",,,,5/2022: O koeficientu pro stanovení daně z nemovitosti; 5/2022: O koeficientu pro stanovení daně z nemovitosti,False,2022-12-28,https://sbirkapp.gov.cz/detail/SPPVXSM5NWVIPVCG,1086089732,1
Město Klecany,00240290,4d6bdnh,Středočeský kraj,2/2022,Obecně závazná vyhláška,O místním poplatku za obecní systém odpadovém hospodářství,2022-07-22 11:15:15.237563+02:00,2022-07-22 11:15:15.237563+02:00,2023-01-01,Běžný,,zrušovací,"ústavní zákon č. 1/1993 Sb., Ústava České republiky - čl. 104 odst. 3 - zrušovací OZV",,2/2021: O místním poplatku za obecní systém odpadovém hospodářství,,,True,,https://sbirkapp.gov.cz/detail/SPPCEJTNTMGIXN7W,1064052097,2
Město Klecany,00240290,4d6bdnh,Středočeský kraj,1/2022,Obecně závazná vyhláška,O místním poplatku z pobytu,2022-07-22 11:12:13.450169+02:00,2022-07-22 11:12:13.450169+02:00,2022-08-06,Běžný,,místní poplatek z pobytu,"zákon č. 565/1990 Sb., o místních poplatcích - § 14 - z pobytu",,,,,True,,https://sbirkapp.gov.cz/detail/SPPBTPYWJ3TSS4NQ,1064050597,1
