Publikující,Publikující ID OVM (IČO),Datová schránka publikujícího,Kraj publikujícího,Číslo právního předpisu,Druh právního předpisu,Název právního předpisu,Datum vydání,Datum zveřejnění ve Sbírce,Datum nabytí účinnosti,Způsob zveřejnění,Datum vyvěšení na úřední desce,Oblast právní úpravy,Zákonné zmocnění,Novelizuje,Zrušuje,Je novelizován,Je rušen,Platný právní předpis,Zrušeno k,URL záznamu,ID zprávy prvotního vkladu,Verze
Obec Bozkov,00275611,bz9an9g,Liberecký kraj,3/2024,Obecně závazná vyhláška,o místním poplatku za užívání veřejného prostranství,2024-06-26 13:17:25.805477+02:00,2024-06-26 13:17:25.805477+02:00,2024-07-11,Běžný,,místní poplatek za užívání veřejného prostranství,"zákon č. 565/1990 Sb., o místních poplatcích - § 14 - za užívání veřejného prostranství",,"4/2023: Obecně závazná vyhláška obce Bozkov o místním poplatku za užívání veřejného prostranství; 2/2024: kterou se mění obecně závazná vyhláška č. 4/2023,  o místním poplatku za užívání veřejného prostranství",,,True,,https://sbirkapp.gov.cz/detail/SPPRP3AYTS4HTWBM,1377987335,1
Obec Bozkov,00275611,bz9an9g,Liberecký kraj,2/2024,Obecně závazná vyhláška,"kterou se mění obecně závazná vyhláška č. 4/2023,  o místním poplatku za užívání veřejného prostranství",2024-03-17 21:00:30.012556+01:00,2024-03-17 21:00:30.012556+01:00,2024-04-01,Běžný,,místní poplatek za užívání veřejného prostranství,"zákon č. 565/1990 Sb., o místních poplatcích - § 14 - za užívání veřejného prostranství",4/2023: Obecně závazná vyhláška obce Bozkov o místním poplatku za užívání veřejného prostranství,,,3/2024: o místním poplatku za užívání veřejného prostranství,False,2024-07-11,https://sbirkapp.gov.cz/detail/SPPSGH5WVLDR245O,1330613908,1
Obec Bozkov,00275611,bz9an9g,Liberecký kraj,1/2024,Obecně závazná vyhláška,"kterou se zrušuje obecně závazná vyhláška č. 2/2022, o místním poplatku za odkládání komunálního odpadu z nemovité věci",2024-03-17 20:56:42.425183+01:00,2024-03-17 20:56:42.425183+01:00,2024-04-01,Běžný,,zrušovací,"ústavní zákon č. 1/1993 Sb., Ústava České republiky - čl. 104 odst. 3 - zrušovací OZV",,2/2022: Obecně závazná vyhláška obce Bozkov o místním poplatku za odkládání komunálního odpadu z nemovité věci,,,True,,https://sbirkapp.gov.cz/detail/SPPIHMZ2TDR7X7MM,1330613182,2
Obec Bozkov,00275611,bz9an9g,Liberecký kraj,4/2023,Obecně závazná vyhláška,Obecně závazná vyhláška obce Bozkov o místním poplatku za užívání veřejného prostranství,2023-12-15 20:39:32.659244+01:00,2023-12-15 20:39:32.659244+01:00,2024-01-01,Běžný,,místní poplatek za užívání veřejného prostranství,"zákon č. 565/1990 Sb., o místních poplatcích - § 14 - za užívání veřejného prostranství",,,"2/2024: kterou se mění obecně závazná vyhláška č. 4/2023,  o místním poplatku za užívání veřejného prostranství",3/2024: o místním poplatku za užívání veřejného prostranství,False,2024-07-11,https://sbirkapp.gov.cz/detail/SPPYMATN3MTAQQTU,1286612729,1
Obec Bozkov,00275611,bz9an9g,Liberecký kraj,3/2023,Obecně závazná vyhláška,Obecně závazná vyhláška obce Bozkov o místním poplatku ze psů,2023-12-15 20:37:11.544328+01:00,2023-12-15 20:37:11.544328+01:00,2024-01-01,Běžný,,místní poplatek ze psů,"zákon č. 565/1990 Sb., o místních poplatcích - § 14 - ze psů",,1/2022: Obecně závazná vyhláška obce Bozkov o místním poplatku ze psů,,,True,,https://sbirkapp.gov.cz/detail/SPPFZCEZPZLNC3HG,1286611935,1
Obec Bozkov,00275611,bz9an9g,Liberecký kraj,2/2023,Obecně závazná vyhláška,Obecně závazná vyhláška obce Bozkov o místním poplatku z pobytu,2023-12-15 20:34:50.695779+01:00,2023-12-15 20:34:50.695779+01:00,2024-01-01,Běžný,,místní poplatek z pobytu,"zákon č. 565/1990 Sb., o místních poplatcích - § 14 - z pobytu",,,,,True,,https://sbirkapp.gov.cz/detail/SPPS2KIIGHUIKRS2,1286611289,1
Obec Bozkov,00275611,bz9an9g,Liberecký kraj,1/2023,Obecně závazná vyhláška,Obecně závazná vyhláška obce Bozkov o místním poplatku za odkládání komunálního odpadu z nemovité věci,2023-12-15 20:31:39.049520+01:00,2023-12-15 20:31:39.049520+01:00,2024-01-01,Běžný,,místní poplatek za odkládání komunálního odpadu z nemovité věci,"zákon č. 565/1990 Sb., o místních poplatcích - § 14 - za odkládání komunálního odpadu z nemovité věci",,,,,True,,https://sbirkapp.gov.cz/detail/SPP63RPTDXMAXSXG,1286610429,2
Obec Bozkov,00275611,bz9an9g,Liberecký kraj,2/2022,Obecně závazná vyhláška,Obecně závazná vyhláška obce Bozkov o místním poplatku za odkládání komunálního odpadu z nemovité věci,2022-12-16 18:17:10.365585+01:00,2022-12-16 18:17:10.365585+01:00,2023-01-01,Běžný,,místní poplatek za odkládání komunálního odpadu z nemovité věci,"zákon č. 565/1990 Sb., o místních poplatcích - § 14 - za odkládání komunálního odpadu z nemovité věci",,,,"1/2023: Obecně závazná vyhláška obce Bozkov o místním poplatku za odkládání komunálního odpadu z nemovité věci; 1/2024: kterou se zrušuje obecně závazná vyhláška č. 2/2022, o místním poplatku za odkládání komunálního odpadu z nemovité věci; 1/2024: kterou se zrušuje obecně závazná vyhláška č. 2/2022, o místním poplatku za odkládání komunálního odpadu z nemovité věci",False,2024-04-01,https://sbirkapp.gov.cz/detail/SPPBMSEEAXEBEKCW,1117599298,1
Obec Bozkov,00275611,bz9an9g,Liberecký kraj,1/2022,Obecně závazná vyhláška,Obecně závazná vyhláška obce Bozkov o místním poplatku ze psů,2022-12-16 18:05:06.082511+01:00,2022-12-16 18:05:06.082511+01:00,2023-01-01,Běžný,,místní poplatek ze psů,"zákon č. 565/1990 Sb., o místních poplatcích - § 14 - ze psů",,,,3/2023: Obecně závazná vyhláška obce Bozkov o místním poplatku ze psů,False,2024-01-01,https://sbirkapp.gov.cz/detail/SPPUKXLBPAQ7IMRA,1117595398,1
