Publikující,Publikující ID OVM (IČO),Datová schránka publikujícího,Kraj publikujícího,Číslo právního předpisu,Druh právního předpisu,Název právního předpisu,Datum vydání,Datum zveřejnění ve Sbírce,Datum nabytí účinnosti,Způsob zveřejnění,Datum vyvěšení na úřední desce,Oblast právní úpravy,Zákonné zmocnění,Novelizuje,Zrušuje,Je novelizován,Je rušen,Platný právní předpis,Zrušeno k,URL záznamu,ID zprávy prvotního vkladu,Verze
Město Ralsko,00831514,xztbtsz,Liberecký kraj,2/2024,Obecně závazná vyhláška,"Obecně závazná vyhláška, kterou se zrušují některé obecně závazné vyhlášky",2024-04-26 10:14:34.506579+02:00,2024-04-26 10:14:34.506579+02:00,2024-05-11,Běžný,,zrušovací,"ústavní zákon č. 1/1993 Sb., Ústava České republiky - čl. 104 odst. 3 - zrušovací OZV",,"3/2019: Obecně závazná vyhláška města Ralsko č. 3/2019, o místním poplatku ze psů; 2/2021: Obecně závazná vyhláška města Ralsko č. 2/2021, o místním poplatku z pobytu; 1/2023: Obecně závazná vyhláška města Ralsko o místním poplatku za užívání veřejného prostranství; 2/2023: Obecně závazná vyhláška ze vstupného ",,,True,,https://sbirkapp.gov.cz/detail/SPPGFNZVDKET6DWC,1350102472,1
Město Ralsko,00831514,xztbtsz,Liberecký kraj,1/2024,VÝMAZ,-,-,-,-,-,-,-,-,-,-,-,-,-,-,-,1328229482,2
Město Ralsko,00831514,xztbtsz,Liberecký kraj,8/2023,Obecně závazná vyhláška,Obecně závazná vyhláška města o stanovení obecního systému odpadového hospodářství,2023-12-14 11:18:06.114949+01:00,2023-12-14 11:18:06.114949+01:00,2023-12-29,Běžný,,systém odpadového hospodářství,"zákon č. 541/2020 Sb., o odpadech - § 59 odst. 4",,"1/2021: Obecně závazná vyhláška města Ralsko č. 1/2021, o stanovení obecného systému odpadového hospodářství",,,True,,https://sbirkapp.gov.cz/detail/SPPWXD67F7ZNQMBO,1285738119,4
Město Ralsko,00831514,xztbtsz,Liberecký kraj,7/2023,Obecně závazná vyhláška,kterou se upravují pravidla pro pohyb psů na veřejných prostranstvích,2023-06-08 11:12:54.328813+02:00,2023-06-08 11:12:54.328813+02:00,2023-06-23,Běžný,,pohyb psů,"zákon č. 246/1992 Sb., na ochranu zvířat proti týrání - § 24 odst. 2",,"1/2017: Obecně závazná vyhláška města Ralsko č. 1/2017, kterou se stanovují pravidla pro pohyb psů na veřejném prostranství",,,True,,https://sbirkapp.gov.cz/detail/SPP2X6WC75V6Q23M,1200721950,1
Město Ralsko,00831514,xztbtsz,Liberecký kraj,6/2023,VÝMAZ,-,-,-,-,-,-,-,-,-,-,-,-,-,-,-,1199463543,2
Město Ralsko,00831514,xztbtsz,Liberecký kraj,5/2023,VÝMAZ,-,-,-,-,-,-,-,-,-,-,-,-,-,-,-,1189662862,1
Město Ralsko,00831514,xztbtsz,Liberecký kraj,4/2023,VÝMAZ,-,-,-,-,-,-,-,-,-,-,-,-,-,-,-,1189661369,1
Město Ralsko,00831514,xztbtsz,Liberecký kraj,3/2023,Obecně závazná vyhláška,"Obecně závazná vyhláška, kterou se zrušují některé obecně závazné vyhlášky",2023-05-15 10:11:46.367155+02:00,2023-05-15 10:11:46.367155+02:00,2023-05-30,Běžný,,zrušovací,"ústavní zákon č. 1/1993 Sb., Ústava České republiky - čl. 104 odst. 3 - zrušovací OZV",,"1/2012: Obecně závazná vyhláška č. 1/2012, kterou se vydává Požární řád města Ralsko a stanoví podmínky k zabezpečení požární ochrany při akcích, kterých se účastní větší počet osob; 6/2018: Obecně závazná vyhláška č. 6/2018, o regulaci zábavní pyrotechniky ; 2/2020: Obecně závazná vyhláška č. 2/2020, o zákazu používání alkoholických nápojů a jiných omamných látek a psychotropních látek na vybraných veřejných prostranstvích",,,True,,https://sbirkapp.gov.cz/detail/SPP2QEWK74CUCBOU,1189652754,2
Město Ralsko,00831514,xztbtsz,Liberecký kraj,2/2023,Obecně závazná vyhláška,Obecně závazná vyhláška ze vstupného ,2023-05-03 09:16:41.636728+02:00,2023-05-03 09:16:41.636728+02:00,2023-05-18,Běžný,,místní poplatek ze vstupného,"zákon č. 565/1990 Sb., o místních poplatcích - § 14 - ze vstupného",,,,"2/2024: Obecně závazná vyhláška, kterou se zrušují některé obecně závazné vyhlášky",False,2024-05-11,https://sbirkapp.gov.cz/detail/SPPDUHUI2XZ5FQWK,1184336183,2
Město Ralsko,00831514,xztbtsz,Liberecký kraj,1/2023,Obecně závazná vyhláška,Obecně závazná vyhláška města Ralsko o místním poplatku za užívání veřejného prostranství,2023-02-16 10:21:03.189762+01:00,2023-02-16 10:21:03.189762+01:00,2023-03-03,Běžný,,místní poplatek za užívání veřejného prostranství,"zákon č. 565/1990 Sb., o místních poplatcích - § 14 - za užívání veřejného prostranství",,"7/2010: Obecně závazná vyhláška č. 7/2010, o místním poplatku za užívání veřejného prostranství",,"2/2024: Obecně závazná vyhláška, kterou se zrušují některé obecně závazné vyhlášky",False,2024-05-11,https://sbirkapp.gov.cz/detail/SPPFM3P45QPKAPS6,1144748162,2
Město Ralsko,00831514,xztbtsz,Liberecký kraj,13/2006,Obecně závazná vyhláška,"Obecně závazná vyhláška č. 13/2006, o zřízení obecní policie, podrobnostech stejnokroje strážníků obecní policie a podrobnostech jeho nošení",2006-02-24,2023-01-16 14:35:29.564160+01:00,2006-02-24,Dle přechodného ustanovení,2006-02-24,obecní policie,"zákon č. 553/1991 Sb., o obecní policii - § 1 odst. 1 ",,,"5/2010: Obecně závazná vyhláška č. 5/2010 kterou se mění Obecně závazná vyhláška č. 13/2006 o zřízení Obecní policie, podrobnostech stejnokroje strážníků obecní policie a podrobnostech jeho nošení",,True,,https://sbirkapp.gov.cz/detail/SPPRZFSE33WATRUM,1129699870,1
Město Ralsko,00831514,xztbtsz,Liberecký kraj,14/2006,Obecně závazná vyhláška,Obecně závazná vyhláška č 14/2006 Symboly obce Ralsko,2006-02-24,2023-01-16 13:28:42.754587+01:00,2006-02-24,Dle přechodného ustanovení,2006-02-24,jiná,"ústavní zákon č. 1/1993 Sb., Ústava České republiky - čl. 104 odst. 3 ",,,,,True,,https://sbirkapp.gov.cz/detail/SPPP3CRRHZ42HTNK,1129642678,2
Město Ralsko,00831514,xztbtsz,Liberecký kraj,2/2021,Obecně závazná vyhláška,"Obecně závazná vyhláška města Ralsko č. 2/2021, o místním poplatku z pobytu",2021-02-15,2023-01-12 10:59:00.959220+01:00,2021-03-02,Dle přechodného ustanovení,2021-02-15,místní poplatek z pobytu,"zákon č. 565/1990 Sb., o místních poplatcích - § 14 - z pobytu",,,,"2/2024: Obecně závazná vyhláška, kterou se zrušují některé obecně závazné vyhlášky",False,2024-05-11,https://sbirkapp.gov.cz/detail/SPPEFSHFIZQWRS5O,1128128548,1
Město Ralsko,00831514,xztbtsz,Liberecký kraj,1/2021,Obecně závazná vyhláška,"Obecně závazná vyhláška města Ralsko č. 1/2021, o stanovení obecného systému odpadového hospodářství",2021-02-15,2023-01-12 10:55:38.590416+01:00,2021-03-02,Dle přechodného ustanovení,2021-02-15,systém odpadového hospodářství,"zákon č. 541/2020 Sb., o odpadech - § 59 odst. 4",,,,8/2023: Obecně závazná vyhláška města o stanovení obecního systému odpadového hospodářství; 8/2023: Obecně závazná vyhláška města o stanovení obecního systému odpadového hospodářství; 8/2023: Obecně závazná vyhláška města o stanovení obecního systému odpadového hospodářství; 8/2023: Obecně závazná vyhláška města o stanovení obecního systému odpadového hospodářství,False,2023-12-29,https://sbirkapp.gov.cz/detail/SPPS6ESR7C45DN5M,1128125685,2
Město Ralsko,00831514,xztbtsz,Liberecký kraj,2/2020,Obecně závazná vyhláška,"Obecně závazná vyhláška č. 2/2020, o zákazu používání alkoholických nápojů a jiných omamných látek a psychotropních látek na vybraných veřejných prostranstvích",2020-07-13,2023-01-12 10:43:47.046732+01:00,2020-07-28,Dle přechodného ustanovení,2020-07-13,veřejný pořádek - konzumace alkoholu; alkohol - zákaz konzumace,"zákon č. 128/2000 Sb., o obcích - § 10 písm. a) - konzumace alkoholu; zákon č. 65/2017 Sb., o ochraně zdraví před škodlivými účinky návykových látek - § 17 odst. 2 písm. a)",,,,"3/2023: Obecně závazná vyhláška, kterou se zrušují některé obecně závazné vyhlášky",False,2023-05-30,https://sbirkapp.gov.cz/detail/SPPMCFIPHWSO7GQQ,1128117906,2
Město Ralsko,00831514,xztbtsz,Liberecký kraj,3/2019,Obecně závazná vyhláška,"Obecně závazná vyhláška města Ralsko č. 3/2019, o místním poplatku ze psů",2019-12-06,2023-01-12 10:38:09.148238+01:00,2020-01-01,Dle přechodného ustanovení,2019-12-06,místní poplatek ze psů,"zákon č. 565/1990 Sb., o místních poplatcích - § 14 - ze psů",,,,"2/2024: Obecně závazná vyhláška, kterou se zrušují některé obecně závazné vyhlášky",False,2024-05-11,https://sbirkapp.gov.cz/detail/SPPFXLW6QSIQJLUS,1128111835,1
Město Ralsko,00831514,xztbtsz,Liberecký kraj,6/2018,Obecně závazná vyhláška,"Obecně závazná vyhláška č. 6/2018, o regulaci zábavní pyrotechniky ",2018-09-07,2023-01-12 10:33:21.470636+01:00,2018-09-22,Dle přechodného ustanovení,2018-09-07,veřejný pořádek - pyrotechnika,"zákon č. 128/2000 Sb., o obcích - § 10 písm. a) - pyrotechnika",,,,"3/2023: Obecně závazná vyhláška, kterou se zrušují některé obecně závazné vyhlášky",False,2023-05-30,https://sbirkapp.gov.cz/detail/SPPPCVPCMZEQMKKU,1128108621,1
Město Ralsko,00831514,xztbtsz,Liberecký kraj,5/2018,Obecně závazná vyhláška,"Obecně závazná vyhláška č. 5/2018, o regulaci hlučných činností",2018-07-02,2023-01-12 10:30:18.767506+01:00,2018-07-17,Dle přechodného ustanovení,2018-07-02,veřejný pořádek - hlučné činnosti,"zákon č. 128/2000 Sb., o obcích - § 10 písm. a) - hlučné činnosti",,,,,True,,https://sbirkapp.gov.cz/detail/SPPQ3D7RGMMFV5OC,1128105967,1
Město Ralsko,00831514,xztbtsz,Liberecký kraj,2/2018,Obecně závazná vyhláška,"Obecně závazná vyhláška města Ralsko č. 2/2018, o nočním klidu",2018-02-01,2023-01-12 10:03:41.600279+01:00,2018-02-16,Dle přechodného ustanovení,2018-02-01,noční klid,"zákon č. 251/2016 Sb., o některých přestupcích - § 5 odst. 7",,,,,True,,https://sbirkapp.gov.cz/detail/SPPQSGAWRPSI6CTW,1128086104,2
Město Ralsko,00831514,xztbtsz,Liberecký kraj,3/2017,Obecně závazná vyhláška,"Obecně závazná vyhláška č. 3/2017, kterou se zrušuje Obecně závazná vyhláška č.1/2016, o místním poplatku za provoz systému shromažďování, sběru, přepravy, třídění, využívání a odstraňování komunálních odpadů",2017-09-29,2023-01-11 13:46:56.053351+01:00,2018-01-01,Dle přechodného ustanovení,2017-09-29,zrušovací,"ústavní zákon č. 1/1993 Sb., Ústava České republiky - čl. 104 odst. 3 - zrušovací OZV",,,,,True,,https://sbirkapp.gov.cz/detail/SPPEQP6VCI6FOLVI,1127638771,1
Město Ralsko,00831514,xztbtsz,Liberecký kraj,2/2017,Obecně závazná vyhláška,"Obecně závazná vyhláška č. 2/2017, o stanovení místního koeficientu pro výpočet daně z nemovitých věcí",2017-09-29,2023-01-11 13:39:15.742612+01:00,2018-01-01,Dle přechodného ustanovení,2017-09-29,daň z nemovitých věcí - místní koeficient,"zákon č. 338/1992 Sb., o dani z nemovitých věcí - § 12",,,,,True,,https://sbirkapp.gov.cz/detail/SPP2EVTB77AEI6IW,1127626341,1
Město Ralsko,00831514,xztbtsz,Liberecký kraj,1/2017,Obecně závazná vyhláška,"Obecně závazná vyhláška města Ralsko č. 1/2017, kterou se stanovují pravidla pro pohyb psů na veřejném prostranství",2017-06-30,2023-01-11 13:24:44.301153+01:00,2017-07-01,Dle přechodného ustanovení,2017-06-30,pohyb psů; veřejný pořádek - jiné,"zákon č. 246/1992 Sb., na ochranu zvířat proti týrání - § 24 odst. 2; zákon č. 128/2000 Sb., o obcích - § 10 písm. c) - jiné",,,,7/2023: kterou se upravují pravidla pro pohyb psů na veřejných prostranstvích,False,2023-06-23,https://sbirkapp.gov.cz/detail/SPPMSP5I25OLIY2C,1127602473,3
Město Ralsko,00831514,xztbtsz,Liberecký kraj,3/2016,VÝMAZ,-,-,-,-,-,-,-,-,-,-,-,-,-,-,-,1127469804,1
Město Ralsko,00831514,xztbtsz,Liberecký kraj,2/2015,VÝMAZ,-,-,-,-,-,-,-,-,-,-,-,-,-,-,-,1127443400,1
Město Ralsko,00831514,xztbtsz,Liberecký kraj,2/2013,VÝMAZ,-,-,-,-,-,-,-,-,-,-,-,-,-,-,-,1127399228,1
Město Ralsko,00831514,xztbtsz,Liberecký kraj,1/2012,Obecně závazná vyhláška,"Obecně závazná vyhláška č. 1/2012, kterou se vydává Požární řád města Ralsko a stanoví podmínky k zabezpečení požární ochrany při akcích, kterých se účastní větší počet osob",2012-02-03,2023-01-11 11:03:34.579621+01:00,2012-02-18,Dle přechodného ustanovení,2012-02-03,požární ochrana - požární řád; požární ochrana - podmínky při akcích,"zákon č. 133/1985 Sb., o požární ochraně - § 29 odst. 1 písm. o) bod 1; zákon č. 133/1985 Sb., o požární ochraně - § 29 odst. 1 písm. o) bod 2",,,,"3/2023: Obecně závazná vyhláška, kterou se zrušují některé obecně závazné vyhlášky",False,2023-05-30,https://sbirkapp.gov.cz/detail/SPPNW24BB6G37W2W,1127391798,2
Město Ralsko,00831514,xztbtsz,Liberecký kraj,9/2010,Obecně závazná vyhláška,"Obecně závazná vyhláška č. 9/2010, o místním poplatku ze vstupného",2010-12-02,2023-01-11 10:52:33.801978+01:00,2011-01-01,Dle přechodného ustanovení,2010-12-02,místní poplatek ze vstupného,"zákon č. 565/1990 Sb., o místních poplatcích - § 14 - ze vstupného",,,,,True,,https://sbirkapp.gov.cz/detail/SPPQJKLQOJJB2FSM,1127382706,1
Město Ralsko,00831514,xztbtsz,Liberecký kraj,7/2010,Obecně závazná vyhláška,"Obecně závazná vyhláška č. 7/2010, o místním poplatku za užívání veřejného prostranství",2010-12-02,2023-01-11 08:20:05.174056+01:00,2011-01-01,Dle přechodného ustanovení,2010-12-02,místní poplatek za užívání veřejného prostranství,"zákon č. 565/1990 Sb., o místních poplatcích - § 14 - za užívání veřejného prostranství",,,1/2023: Obecně závazná vyhláška města Ralsko o místním poplatku za užívání veřejného prostranství,1/2023: Obecně závazná vyhláška města Ralsko o místním poplatku za užívání veřejného prostranství,False,2023-03-03,https://sbirkapp.gov.cz/detail/SPPT4MZWPE4MXQTA,1127265343,1
Město Ralsko,00831514,xztbtsz,Liberecký kraj,5/2010,Obecně závazná vyhláška,"Obecně závazná vyhláška č. 5/2010 kterou se mění Obecně závazná vyhláška č. 13/2006 o zřízení Obecní policie, podrobnostech stejnokroje strážníků obecní policie a podrobnostech jeho nošení",2010-06-18,2023-01-10 14:14:21.444751+01:00,2010-07-03,Dle přechodného ustanovení,2010-06-18,obecní policie,"zákon č. 553/1991 Sb., o obecní policii - § 1 odst. 1 ","13/2006: Obecně závazná vyhláška č. 13/2006, o zřízení obecní policie, podrobnostech stejnokroje strážníků obecní policie a podrobnostech jeho nošení",,,,True,,https://sbirkapp.gov.cz/detail/SPP7CLI7EFZJS53W,1126938945,2
Město Ralsko,00831514,xztbtsz,Liberecký kraj,1/2022,Obecně závazná vyhláška,"Obecně závazná vyhláška, kterou se zrušuje obecně závazná vyhláška č. 2/2019, k trvalému označování psů a evidenci jejich majitelů",2022-02-21 10:34:25.756746+01:00,2022-02-21 10:34:25.756746+01:00,2022-03-08,Běžný,,zrušovací,"ústavní zákon č. 1/1993 Sb., Ústava České republiky - čl. 104 odst. 3 - zrušovací OZV",,"2/2019: Obecně závazná vyhláška města Ralsko č. 2/2019, o evidenci chovatelů a jejich trvale označených psů",,,True,,https://sbirkapp.gov.cz/detail/SPPMUP653627XFHG,1005776184,2
Město Ralsko,00831514,xztbtsz,Liberecký kraj,2/2019,Obecně závazná vyhláška,"Obecně závazná vyhláška města Ralsko č. 2/2019, o evidenci chovatelů a jejich trvale označených psů",2019-12-06,2022-02-21 10:26:53.142833+01:00,2020-01-01,Dle přechodného ustanovení,2019-12-06,veřejný pořádek - chov a pohyb zvířat,"zákon č. 128/2000 Sb., o obcích - § 10 písm. a)  - chov a pohyb zvířat",,,,"1/2022: Obecně závazná vyhláška, kterou se zrušuje obecně závazná vyhláška č. 2/2019, k trvalému označování psů a evidenci jejich majitelů; 1/2022: Obecně závazná vyhláška, kterou se zrušuje obecně závazná vyhláška č. 2/2019, k trvalému označování psů a evidenci jejich majitelů",False,2022-03-08,https://sbirkapp.gov.cz/detail/SPPFYKHUT2DT5WWA,1005768400,1
