Publikující,Publikující ID OVM (IČO),Datová schránka publikujícího,Kraj publikujícího,Číslo právního předpisu,Druh právního předpisu,Název právního předpisu,Datum vydání,Datum zveřejnění ve Sbírce,Datum nabytí účinnosti,Způsob zveřejnění,Datum vyvěšení na úřední desce,Oblast právní úpravy,Zákonné zmocnění,Novelizuje,Zrušuje,Je novelizován,Je rušen,Platný právní předpis,Zrušeno k,URL záznamu,ID zprávy prvotního vkladu,Verze
Obec Bílovice-Lutotín,00288012,63bar5k,Olomoucký kraj,6/2023,Obecně závazná vyhláška,OBEC Bílovice-Lutotín Zastupitelstvo obce Bílovice-Lutotín Obecně závazná vyhláška obce Bílovice-Lutotín o nočním klidu,2023-12-15 22:29:59.802025+01:00,2023-12-15 22:29:59.802025+01:00,2023-12-30,Běžný,,noční klid,"zákon č. 251/2016 Sb., o některých přestupcích - § 5 odst. 7",,1/2023: Obecně závazná vyhláška obce Bílovice-Lutotín o nočním klidu,,,True,,https://sbirkapp.gov.cz/detail/SPP7PR3YZGCFWWOO,1286637395,1
Obec Bílovice-Lutotín,00288012,63bar5k,Olomoucký kraj,5/2023,Nařízení,"Nařízení obce Bílovice - Lutotín, kterým se ruší Obecně závazná vyhláška  č. 1/2003 obce Bílovice - Lutotín o stanovení koeficientu pro výpočet daně z nemovitosti",2023-12-15 08:42:16.984192+01:00,2023-12-15 08:42:16.984192+01:00,2024-01-01,Běžný,,zrušovací,"ústavní zákon č. 1/1993 Sb., Ústava České republiky - čl. 79 odst. 3 - zrušovací nařízení",,,,,True,,https://sbirkapp.gov.cz/detail/SPPZANNYIKYLCZO2,1286204212,2
Obec Bílovice-Lutotín,00288012,63bar5k,Olomoucký kraj,4/2023,Obecně závazná vyhláška,Obecně závazná vyhláška obce Bílovice-Lutotín o místním poplatku ze psů,2023-12-15 08:35:56.104866+01:00,2023-12-15 08:35:56.104866+01:00,2024-01-01,Běžný,,místní poplatek ze psů,"zákon č. 565/1990 Sb., o místních poplatcích - § 14 - ze psů",,"2/2019: Obecně závazná vyhláška obce Bílovice-Lutotín č.2/2019, o místním poplatku ze psů ",,,True,,https://sbirkapp.gov.cz/detail/SPPKUQC5MM66G6J2,1286200650,2
Obec Bílovice-Lutotín,00288012,63bar5k,Olomoucký kraj,3/2023,Obecně závazná vyhláška,Obecně závazná vyhláška obce Bílovice-Lutotín o místním poplatku za obecní systém odpadového hospodářství,2023-12-15 08:33:05.432716+01:00,2023-12-15 08:33:05.432716+01:00,2024-01-01,Běžný,,místní poplatek za obecní systém odpadového hospodářství,"zákon č. 565/1990 Sb., o místních poplatcích - § 14 - za obecní systém odpadového hospodářství",,"2/2021: Obecně závazná vyhláška obce Bílovice - Lutotín č.2/2021, o místním poplatku za obecní systém odpadového hospodářství",,,True,,https://sbirkapp.gov.cz/detail/SPPDWQSDQPYYIORC,1286199166,2
Obec Bílovice-Lutotín,00288012,63bar5k,Olomoucký kraj,1/2003,Nařízení,"Obecně závazná vyhláška obce č. 1/2003, o použití koeficientu pro výpočet daně z nemovitostí",2003-07-17,2023-10-30 15:37:35.448534+01:00,2004-01-01,Dle přechodného ustanovení,2003-07-17,,,,,,,True,,https://sbirkapp.gov.cz/detail/SPPENBEAALGI3TS6,1262008147,3
Obec Bílovice-Lutotín,00288012,63bar5k,Olomoucký kraj,2/2023,Obecně závazná vyhláška,"Obecně závazná vyhláška obce č. 2/2023, kterou se vydává požární řád obce",2023-10-23 13:48:05.532016+02:00,2023-10-23 13:48:05.532016+02:00,2023-11-07,Běžný,,požární ochrana - požární řád,"zákon č. 133/1985 Sb., o požární ochraně - § 29 odst. 1 písm. o) bod 1",,,,,True,,https://sbirkapp.gov.cz/detail/SPPPUULLMJKC3IY2,1258454477,2
Obec Bílovice-Lutotín,00288012,63bar5k,Olomoucký kraj,2/2019,Obecně závazná vyhláška,"Obecně závazná vyhláška obce Bílovice-Lutotín č.2/2019, o místním poplatku ze psů ",2019-12-18,2023-01-23 13:21:09.609049+01:00,2020-01-01,Dle přechodného ustanovení,2019-12-18,místní poplatek ze psů,"zákon č. 565/1990 Sb., o místních poplatcích - § 14 - ze psů",,,,4/2023: Obecně závazná vyhláška obce Bílovice-Lutotín o místním poplatku ze psů; 4/2023: Obecně závazná vyhláška obce Bílovice-Lutotín o místním poplatku ze psů,False,2024-01-01,https://sbirkapp.gov.cz/detail/SPPLLFDELNHGUDCE,1132759730,1
Obec Bílovice-Lutotín,00288012,63bar5k,Olomoucký kraj,2/2021,Obecně závazná vyhláška,"Obecně závazná vyhláška obce Bílovice - Lutotín č.2/2021, o místním poplatku za obecní systém odpadového hospodářství",2021-12-10,2023-01-23 13:17:22.697120+01:00,2022-01-01,Dle přechodného ustanovení,2021-12-10,místní poplatek za obecní systém odpadového hospodářství,"zákon č. 565/1990 Sb., o místních poplatcích - § 14 - za obecní systém odpadového hospodářství",,,,3/2023: Obecně závazná vyhláška obce Bílovice-Lutotín o místním poplatku za obecní systém odpadového hospodářství; 3/2023: Obecně závazná vyhláška obce Bílovice-Lutotín o místním poplatku za obecní systém odpadového hospodářství,False,2024-01-01,https://sbirkapp.gov.cz/detail/SPPG5KB3KYXDBGAW,1132757076,1
Obec Bílovice-Lutotín,00288012,63bar5k,Olomoucký kraj,1/2021,Obecně závazná vyhláška,"OBEC Bílovice - Lutotín Zastupitelstvo obce Bílovice - Lutotín Obecně závazná vyhláška obce Bílovice - Lutotín č.1/2021, o stanovení obecního systému odpadového hospodářství ",2021-12-10,2023-01-23 13:12:50.495273+01:00,2022-01-01,Dle přechodného ustanovení,2021-12-10,systém odpadového hospodářství,"zákon č. 541/2020 Sb., o odpadech - § 59 odst. 4",,,,,True,,https://sbirkapp.gov.cz/detail/SPP2MYBZ6EQBQQ2S,1132754016,2
Obec Bílovice-Lutotín,00288012,63bar5k,Olomoucký kraj,1/2023,Obecně závazná vyhláška,Obecně závazná vyhláška obce Bílovice-Lutotín o nočním klidu,2023-01-23 12:47:08.193123+01:00,2023-01-23 12:47:08.193123+01:00,2023-02-07,Běžný,,noční klid,"zákon č. 251/2016 Sb., o některých přestupcích - § 5 odst. 7",,,,6/2023: OBEC Bílovice-Lutotín Zastupitelstvo obce Bílovice-Lutotín Obecně závazná vyhláška obce Bílovice-Lutotín o nočním klidu,False,2023-12-30,https://sbirkapp.gov.cz/detail/SPPCI6XSC3MHA4N2,1132731894,2
