Publikující,Publikující ID OVM (IČO),Datová schránka publikujícího,Kraj publikujícího,Číslo právního předpisu,Druh právního předpisu,Název právního předpisu,Datum vydání,Datum zveřejnění ve Sbírce,Datum nabytí účinnosti,Způsob zveřejnění,Datum vyvěšení na úřední desce,Oblast právní úpravy,Zákonné zmocnění,Novelizuje,Zrušuje,Je novelizován,Je rušen,Platný právní předpis,Zrušeno k,URL záznamu,ID zprávy prvotního vkladu,Verze
Obec Klenová,00573515,sn4bhwn,Plzeňský kraj,3/2023,Obecně závazná vyhláška,Obecně závazná vyhláška o místním poplatku ze vstupného,2023-12-13 17:06:48.066096+01:00,2023-12-13 17:06:48.066096+01:00,2024-01-01,Běžný,,místní poplatek ze vstupného,"zákon č. 565/1990 Sb., o místních poplatcích - § 14 - ze vstupného",,03/2019: Obecně závazná vyhláška obce Klenová o místním poplatku ze vstupného,,,True,,https://sbirkapp.gov.cz/detail/SPPJYRBEF5CW2YJU,1285374933,1
Obec Klenová,00573515,sn4bhwn,Plzeňský kraj,2/2023,Obecně závazná vyhláška,Obecně závazná vyhláška o místním poplatku ze psů,2023-12-13 17:05:43.462929+01:00,2023-12-13 17:05:43.462929+01:00,2024-01-01,Běžný,,místní poplatek ze psů,"zákon č. 565/1990 Sb., o místních poplatcích - § 14 - ze psů",,02/2019: Obecně závazná vyhláška o místním poplatku ze psů,,,True,,https://sbirkapp.gov.cz/detail/SPPDG5HCGHUPKBNS,1285373249,1
Obec Klenová,00573515,sn4bhwn,Plzeňský kraj,1/2023,Obecně závazná vyhláška,Obecně závazná vyhláška o místním poplatku za odkládání komunálního odpadu z nemovité věci,2023-12-13 17:04:33.310764+01:00,2023-12-13 17:04:33.310764+01:00,2024-01-01,Běžný,,místní poplatek za odkládání komunálního odpadu z nemovité věci,"zákon č. 565/1990 Sb., o místních poplatcích - § 14 - za odkládání komunálního odpadu z nemovité věci",,02/2021: Obecně závazná vyhláška obce Klenová o místním poplatku za odkládání komunálního odpadu z nemovité věci,,,True,,https://sbirkapp.gov.cz/detail/SPPD3H6XLOSEMFMC,1285372133,1
Obec Klenová,00573515,sn4bhwn,Plzeňský kraj,01/2019,Obecně závazná vyhláška,"Obecně závazná vyhláška, kterou se vydává požární řád obce",2019-12-19,2022-11-02 18:25:23.664630+01:00,2020-01-03,Dle přechodného ustanovení,2019-12-19,požární ochrana - požární řád,"zákon č. 133/1985 Sb., o požární ochraně - § 29 odst. 1 písm. o) bod 1",,,,,True,,https://sbirkapp.gov.cz/detail/SPPCEK5VJNVYEOGO,1100616930,1
Obec Klenová,00573515,sn4bhwn,Plzeňský kraj,02/2019,Obecně závazná vyhláška,Obecně závazná vyhláška o místním poplatku ze psů,2019-12-19,2022-11-02 18:22:19.586223+01:00,2020-01-03,Dle přechodného ustanovení,2019-12-19,místní poplatek ze psů,"zákon č. 565/1990 Sb., o místních poplatcích - § 14 - ze psů",,,,2/2023: Obecně závazná vyhláška o místním poplatku ze psů,False,2024-01-01,https://sbirkapp.gov.cz/detail/SPP6DUITURVRIG3W,1100616324,1
Obec Klenová,00573515,sn4bhwn,Plzeňský kraj,03/2019,Obecně závazná vyhláška,Obecně závazná vyhláška obce Klenová o místním poplatku ze vstupného,2019-12-19,2022-11-02 18:20:55.495926+01:00,2020-01-03,Dle přechodného ustanovení,2019-12-19,místní poplatek ze vstupného,"zákon č. 565/1990 Sb., o místních poplatcích - § 14 - ze vstupného",,,,3/2023: Obecně závazná vyhláška o místním poplatku ze vstupného,False,2024-01-01,https://sbirkapp.gov.cz/detail/SPPAQRCGSEFK22UM,1100616167,1
Obec Klenová,00573515,sn4bhwn,Plzeňský kraj,01/2021,Obecně závazná vyhláška,Obecně závazná vyhláška obce Klenová o stanovení podmínek pro pořádání a průběh akcí typu technoparty a o zabezpečení místních záležitostí veřejného pořádku v souvislosti s jejich konáním,2021-10-27,2022-11-02 18:18:58.529138+01:00,2021-11-11,Dle přechodného ustanovení,2021-10-27,veřejný pořádek - regulace akcí typu technoparty,"zákon č. 128/2000 Sb., o obcích - § 10 písm. b) - regulace akcí typu technoparty",,,,,True,,https://sbirkapp.gov.cz/detail/SPPRTIPFRDDHWIUS,1100615403,1
Obec Klenová,00573515,sn4bhwn,Plzeňský kraj,02/2021,Obecně závazná vyhláška,Obecně závazná vyhláška obce Klenová o místním poplatku za odkládání komunálního odpadu z nemovité věci,2021-10-27,2022-11-02 18:12:23.768463+01:00,2022-01-01,Dle přechodného ustanovení,2021-10-27,místní poplatek za odkládání komunálního odpadu z nemovité věci,"zákon č. 565/1990 Sb., o místních poplatcích - § 14 - za odkládání komunálního odpadu z nemovité věci",,,,1/2023: Obecně závazná vyhláška o místním poplatku za odkládání komunálního odpadu z nemovité věci,False,2024-01-01,https://sbirkapp.gov.cz/detail/SPPCOB7XZ55WTWU2,1100611174,1
Obec Klenová,00573515,sn4bhwn,Plzeňský kraj,03/2021,Obecně závazná vyhláška,Obecně závazná vyhláška obce Klenová o stanovení obecního systému odpadového hospodářství,2021-10-27,2022-11-02 18:09:39.423770+01:00,2021-11-11,Dle přechodného ustanovení,2021-10-27,systém odpadového hospodářství,"zákon č. 541/2020 Sb., o odpadech - § 59 odst. 4",,,,,True,,https://sbirkapp.gov.cz/detail/SPPL4QCWK2MCEDZ2,1100609661,1
