Publikující,Publikující ID OVM (IČO),Datová schránka publikujícího,Kraj publikujícího,Číslo právního předpisu,Druh právního předpisu,Název právního předpisu,Datum vydání,Datum zveřejnění ve Sbírce,Datum nabytí účinnosti,Způsob zveřejnění,Datum vyvěšení na úřední desce,Oblast právní úpravy,Zákonné zmocnění,Novelizuje,Zrušuje,Je novelizován,Je rušen,Platný právní předpis,Zrušeno k,URL záznamu,ID zprávy prvotního vkladu,Verze
Obec Babice,00240028,vxtaugv,Středočeský kraj,4/2023,Obecně závazná vyhláška,Obecně závazná vyhláška obce Babice o místním poplatku z pobytu,2023-12-12 10:07:55.725253+01:00,2023-12-12 10:07:55.725253+01:00,2024-01-01,Běžný,,místní poplatek z pobytu,"zákon č. 565/1990 Sb., o místních poplatcích - § 14 - z pobytu",,4/2019: o místním poplatku z pobytu,,,True,,https://sbirkapp.gov.cz/detail/SPPII5Q54JNMDXNG,1284434362,1
Obec Babice,00240028,vxtaugv,Středočeský kraj,3/2023,Obecně závazná vyhláška,Obecně závazná vyhláška obce Babice o místním poplatku ze psů,2023-12-12 10:05:26.747760+01:00,2023-12-12 10:05:26.747760+01:00,2024-01-01,Běžný,,místní poplatek ze psů,"zákon č. 565/1990 Sb., o místních poplatcích - § 14 - ze psů",,5/2019: o místním poplatku ze psů,,,True,,https://sbirkapp.gov.cz/detail/SPP5NVU43LOWMKY4,1284431452,1
Obec Babice,00240028,vxtaugv,Středočeský kraj,2/2023,Obecně závazná vyhláška,Obecně závazná vyhláška obce Babice o místním poplatku za užívání veřejného prostranství,2023-12-12 10:02:47.014771+01:00,2023-12-12 10:02:47.014771+01:00,2024-01-01,Běžný,,místní poplatek za užívání veřejného prostranství,"zákon č. 565/1990 Sb., o místních poplatcích - § 14 - za užívání veřejného prostranství",,6/2019: o místním poplatku za užívání veřejného prostoru,,,True,,https://sbirkapp.gov.cz/detail/SPPPWPWQFFFN7HIK,1284427183,1
Obec Babice,00240028,vxtaugv,Středočeský kraj,1/2023,Obecně závazná vyhláška,Obecně závazná vyhláška obce Babice o místním poplatku za odkládání komunálního odpadu z nemovité věci,2023-12-12 10:01:22.024547+01:00,2023-12-12 10:01:22.024547+01:00,2024-01-01,Běžný,,místní poplatek za odkládání komunálního odpadu z nemovité věci,"zákon č. 565/1990 Sb., o místních poplatcích - § 14 - za odkládání komunálního odpadu z nemovité věci",,3/2021: o místním poplatku za odkládání komunálního odpadu z nemovité věci,,,True,,https://sbirkapp.gov.cz/detail/SPPW2WZ3FI67S5RC,1284419676,2
Obec Babice,00240028,vxtaugv,Středočeský kraj,2/2021,Obecně závazná vyhláška,"OZV kterou se stanoví část společného školského obvodu základní školy. Na základě uzavřené dohody obcí  Babice a obce Mukařov, je území obce Babice částí školského obvodu Základní školy Mukařov",2021-05-06,2022-01-19 15:27:20.233547+01:00,2021-05-21,Dle přechodného ustanovení,2021-05-06,školské obvody - základní školy,"zákon č. 561/2004 Sb., školský zákon - § 178 odst. 2 písm. c)",,,,,True,,https://sbirkapp.gov.cz/detail/SPPRUQT3GNVQNNR6,991270558,2
Obec Babice,00240028,vxtaugv,Středočeský kraj,1/2021,Obecně závazná vyhláška,"OZV kterou se stanoví část společného školského obvodu základní školy. Na základě uzavřené dohody obcí  Babice a města Sázavy, je území obce Babice částí školského obvodu základní školy Základní škola a mateřská škola Sázava",2021-05-06,2022-01-19 15:25:49.188663+01:00,2021-05-21,Dle přechodného ustanovení,2021-05-06,školské obvody - základní školy,"zákon č. 561/2004 Sb., školský zákon - § 178 odst. 2 písm. c)",,,,,True,,https://sbirkapp.gov.cz/detail/SPPKRQWQ5VMC4QSO,991267226,2
Obec Babice,00240028,vxtaugv,Středočeský kraj,1/2018,Obecně závazná vyhláška,OZV kterou se stanoví školské obvody mateřské školy zřízené obcí Babice,2018-10-08,2022-01-19 15:22:01.846924+01:00,2018-10-23,Dle přechodného ustanovení,2018-10-08,školské obvody - mateřské školy,"zákon č. 561/2004 Sb., školský zákon - § 179 odst. 3 a § 178 odst. 2 písm. b)",,,,,True,,https://sbirkapp.gov.cz/detail/SPP72EXUS6AGOXI4,991260655,3
Obec Babice,00240028,vxtaugv,Středočeský kraj,6/2016,Obecně závazná vyhláška,OZV požární řád obce Babice,2016-11-15,2022-01-19 15:19:45.496490+01:00,2016-12-01,Dle přechodného ustanovení,2016-11-15,požární ochrana - požární řád,"zákon č. 133/1985 Sb., o požární ochraně - § 29 odst. 1 písm. o) bod 1",,,,,True,,https://sbirkapp.gov.cz/detail/SPPIVJHWCE2QRUJ2,991255484,2
Obec Babice,00240028,vxtaugv,Středočeský kraj,5/2016,Obecně závazná vyhláška,OZV kterou se stanovují podmínky pro spalování suchých rostlinných materiálů v obci,2016-11-15,2022-01-19 15:15:58.797109+01:00,2016-12-01,Dle přechodného ustanovení,2016-11-15,ochrana ovzduší - spalování suchého rostlinného materiálu,"zákon č. 201/2012 Sb., o ochraně ovzduší - § 16 odst. 5 ",,,,,True,,https://sbirkapp.gov.cz/detail/SPPND5YH5VKPPTH6,991250645,2
Obec Babice,00240028,vxtaugv,Středočeský kraj,4/2016,Obecně závazná vyhláška,pravidla pro pohyb psů na veřejném prostranství za účelem zabezpečení místních záležitostí veřejného pořádku,2016-11-04,2022-01-19 15:12:12.279505+01:00,2016-11-20,Dle přechodného ustanovení,2016-11-04,pohyb psů,"zákon č. 246/1992 Sb., na ochranu zvířat proti týrání - § 24 odst. 2",,,,,True,,https://sbirkapp.gov.cz/detail/SPPGNDK6N4C53NYS,991242235,2
Obec Babice,00240028,vxtaugv,Středočeský kraj,3/2016,Obecně závazná vyhláška,"Obecně závazná vyhláška obce Babice č. 3/2016, kterou se stanovují pravidla pro regulaci hlučných činností za účelem zabezpečení místních záležitostí veřejného pořádku",2016-10-03,2022-01-19 15:06:55.079976+01:00,2016-10-18,Dle přechodného ustanovení,2016-10-03,veřejný pořádek - hlučné činnosti,"zákon č. 128/2000 Sb., o obcích - § 10 písm. a) - hlučné činnosti",,,,,True,,https://sbirkapp.gov.cz/detail/SPPWYW4TUE743QRK,991230990,3
Obec Babice,00240028,vxtaugv,Středočeský kraj,1/2019,Obecně závazná vyhláška,"k zabezpečení místních záležitostí veřejného pořádku na veřejných prostranstvích, kterou se reguluje používání zábavní pyrotechniky",2019-02-06,2022-01-19 15:03:08.337977+01:00,2019-02-21,Dle přechodného ustanovení,2019-02-06,veřejný pořádek - pyrotechnika,"zákon č. 128/2000 Sb., o obcích - § 10 písm. a) - pyrotechnika",,,,,True,,https://sbirkapp.gov.cz/detail/SPP7ANJSDQQ2HOYE,991225332,2
Obec Babice,00240028,vxtaugv,Středočeský kraj,2/2019,Obecně závazná vyhláška,"o stanovení místního koeficientu pro výpočet daně z nemovitosti. V této vyhlášce je stanoven místní koeficient, kterým se násobí daňová povinnost poplatníka za jednotlivé druhy pozemků, staveb, samostatných nebytových prostorů a za byty, popřípadě jejich soubory ve výši 3",2019-05-15,2022-01-19 14:59:21.170758+01:00,2020-01-01,Dle přechodného ustanovení,2019-05-15,daň z nemovitých věcí - místní koeficient,"zákon č. 338/1992 Sb., o dani z nemovitých věcí - § 12",,,,,True,,https://sbirkapp.gov.cz/detail/SPPZDVAHEAEJU6L2,991221704,2
Obec Babice,00240028,vxtaugv,Středočeský kraj,4/2019,Obecně závazná vyhláška,o místním poplatku z pobytu,2019-11-13,2022-01-19 14:31:24.841341+01:00,2019-11-28,Dle přechodného ustanovení,2019-11-13,místní poplatek z pobytu,"zákon č. 565/1990 Sb., o místních poplatcích - § 14 - z pobytu",,,,4/2023: Obecně závazná vyhláška obce Babice o místním poplatku z pobytu,False,2024-01-01,https://sbirkapp.gov.cz/detail/SPPBUJY7JUAUCDCO,991196950,2
Obec Babice,00240028,vxtaugv,Středočeský kraj,5/2019,Obecně závazná vyhláška,o místním poplatku ze psů,2019-11-13,2022-01-19 14:29:08.638091+01:00,2019-11-28,Dle přechodného ustanovení,2019-11-13,místní poplatek ze psů,"zákon č. 565/1990 Sb., o místních poplatcích - § 14 - ze psů",,,,3/2023: Obecně závazná vyhláška obce Babice o místním poplatku ze psů,False,2024-01-01,https://sbirkapp.gov.cz/detail/SPPAZKZMHFH33AKG,991193282,2
Obec Babice,00240028,vxtaugv,Středočeský kraj,6/2019,Obecně závazná vyhláška,o místním poplatku za užívání veřejného prostoru,2019-11-13,2022-01-19 14:26:06.225354+01:00,2019-11-28,Dle přechodného ustanovení,2019-11-13,místní poplatek za užívání veřejného prostranství,"zákon č. 565/1990 Sb., o místních poplatcích - § 14 - za užívání veřejného prostranství",,,,2/2023: Obecně závazná vyhláška obce Babice o místním poplatku za užívání veřejného prostranství,False,2024-01-01,https://sbirkapp.gov.cz/detail/SPPGIZVO7LZZ656A,991187096,1
Obec Babice,00240028,vxtaugv,Středočeský kraj,3/2021,Obecně závazná vyhláška,o místním poplatku za odkládání komunálního odpadu z nemovité věci,2021-11-25,2022-01-19 14:09:29.584201+01:00,2022-01-01,Dle přechodného ustanovení,2021-11-25,místní poplatek za odkládání komunálního odpadu z nemovité věci,"zákon č. 565/1990 Sb., o místních poplatcích - § 14 - za odkládání komunálního odpadu z nemovité věci",,,,1/2023: Obecně závazná vyhláška obce Babice o místním poplatku za odkládání komunálního odpadu z nemovité věci,False,2024-01-01,https://sbirkapp.gov.cz/detail/SPP7A7FSQIIPU5P4,991168626,2
Obec Babice,00240028,vxtaugv,Středočeský kraj,4/2021,Obecně závazná vyhláška,"o stanovení systému shromažďování, sběru, přepravy, třídění, využívání a odstraňování komunálních odpadů a nakládání se stavebním odpadem na území obce Babice",2021-11-25,2022-01-19 13:55:47.806181+01:00,2022-01-01,Dle přechodného ustanovení,2021-11-25,systém odpadového hospodářství,"zákon č. 541/2020 Sb., o odpadech - § 59 odst. 4",,,,,True,,https://sbirkapp.gov.cz/detail/SPPNDUPDAEQTKOVM,991159959,1
Obec Babice,00240028,vxtaugv,Středočeský kraj,1/2016,Nařízení,O zákazu podomního a pochůzkového prodeje na katastrálním území obce Babice (600601),2016-02-11,2022-01-19 13:17:15.354621+01:00,2016-02-26,Dle přechodného ustanovení,2016-02-11,regulace podomního a pochůzkového prodeje a nabízení služeb,"zákon č. 455/1991 Sb., živnostenský zákon - § 18 odst. 4 ",,,,,True,,https://sbirkapp.gov.cz/detail/SPPK7WNOQKP42AOK,991102767,1
